{"text_format":"1","workbook":"xlsx","n_sheets":2,"sheets":["Plan1","Plan2"],"not_rendered":{"charts":0,"images":41,"macros":0,"external_links":0,"defined_names":0,"comments":0,"pivot_tables":0},"unopened":[],"bounds":{"document_bytes":16777216,"sheet_cells":100000,"rows_first":2000,"rows_last":500,"rows_between":2000,"halvings":0,"cell_chars":16384,"cell_head_chars":4096},"cells_cut":0,"cells_raw":0,"read":"whole","date_system":"1900"}

{"sheet":"Plan1","index":0,"n_rows":65,"n_cols":34,"rows_kept":65,"cut":false,"hidden":false,"merged":[[2,21,2,22],[43,10,43,18],[50,0,50,18],[51,10,51,18],[58,0,58,18],[2,24,2,25],[2,27,2,28],[2,30,2,31],[59,10,59,18],[1,0,1,12],[42,0,42,18],[3,10,3,18],[2,0,2,18],[10,0,10,18],[11,10,11,18],[18,0,18,18],[19,10,19,18],[26,0,26,18],[27,10,27,18],[34,0,34,18],[35,10,35,18]]}
[]
["Copa do Mundo - Rússia 2018"]
["Grupo A",null,null,null,null,null,null,null,null,null,null,null,null,null,null,null,null,null,null,null,null,"Oitavas",null,null,"Quartas",null,null,"Semifinal",null,null,"Final"]
["2018-06-14",null,{"$f":"Plan2!C5","v":"Rússia"},null,null,"V",null,null,{"$f":"Plan2!C3","v":"Arábia Saudita"},null,"Classificação Grupo A"]
["2018-06-15",null,{"$f":"Plan2!C4","v":"Egito"},null,null,"V",null,null,{"$f":"Plan2!C6","v":"Uruguai"},null,"Seleções","JG","V","E","D","GP","GC","SG","PT"]
["2018-06-19",null,{"$f":"Plan2!C5","v":"Rússia"},null,null,"V",null,null,{"$f":"Plan2!C4","v":"Egito"},1,{"$f":"VLOOKUP($J6,Plan2!$B$2:$K$6,COLUMNS(Plan1!$K$5:K5)+1,FALSE)","v":"Arábia Saudita"},{"$f":"VLOOKUP($J6,Plan2!$B$2:$K$6,COLUMNS(Plan1!$K$5:L5)+1,FALSE)","v":0},{"$f":"VLOOKUP($J6,Plan2!$B$2:$K$6,COLUMNS(Plan1!$K$5:M5)+1,FALSE)","v":0},{"$f":"VLOOKUP($J6,Plan2!$B$2:$K$6,COLUMNS(Plan1!$K$5:N5)+1,FALSE)","v":0},{"$f":"VLOOKUP($J6,Plan2!$B$2:$K$6,COLUMNS(Plan1!$K$5:O5)+1,FALSE)","v":0},{"$f":"VLOOKUP($J6,Plan2!$B$2:$K$6,COLUMNS(Plan1!$K$5:P5)+1,FALSE)","v":0},{"$f":"VLOOKUP($J6,Plan2!$B$2:$K$6,COLUMNS(Plan1!$K$5:Q5)+1,FALSE)","v":0},{"$f":"VLOOKUP($J6,Plan2!$B$2:$K$6,COLUMNS(Plan1!$K$5:R5)+1,FALSE)","v":0},{"$f":"VLOOKUP($J6,Plan2!$B$2:$K$6,COLUMNS(Plan1!$K$5:S5)+1,FALSE)","v":0},null,null,{"$f":"IF(AND(L6=3,L7=3,L8=3,L9=3),K6,\"A Definir\")","v":"A Definir"}]
["2018-06-20",null,{"$f":"Plan2!C6","v":"Uruguai"},null,null,"V",null,null,{"$f":"Plan2!C3","v":"Arábia Saudita"},2,{"$f":"VLOOKUP($J7,Plan2!$B$2:$K$6,COLUMNS(Plan1!$K$5:K6)+1,FALSE)","v":"Egito"},{"$f":"VLOOKUP($J7,Plan2!$B$2:$K$6,COLUMNS(Plan1!$K$5:L6)+1,FALSE)","v":0},{"$f":"VLOOKUP($J7,Plan2!$B$2:$K$6,COLUMNS(Plan1!$K$5:M6)+1,FALSE)","v":0},{"$f":"VLOOKUP($J7,Plan2!$B$2:$K$6,COLUMNS(Plan1!$K$5:N6)+1,FALSE)","v":0},{"$f":"VLOOKUP($J7,Plan2!$B$2:$K$6,COLUMNS(Plan1!$K$5:O6)+1,FALSE)","v":0},{"$f":"VLOOKUP($J7,Plan2!$B$2:$K$6,COLUMNS(Plan1!$K$5:P6)+1,FALSE)","v":0},{"$f":"VLOOKUP($J7,Plan2!$B$2:$K$6,COLUMNS(Plan1!$K$5:Q6)+1,FALSE)","v":0},{"$f":"VLOOKUP($J7,Plan2!$B$2:$K$6,COLUMNS(Plan1!$K$5:R6)+1,FALSE)","v":0},{"$f":"VLOOKUP($J7,Plan2!$B$2:$K$6,COLUMNS(Plan1!$K$5:S6)+1,FALSE)","v":0},null,null,{"$f":"IF(AND(L14=3,L15=3,L16=3,L17=3),K15,\"A Definir\")","v":"A Definir"}]
["2018-06-25",null,{"$f":"Plan2!C6","v":"Uruguai"},null,null,"V",null,null,{"$f":"Plan2!C5","v":"Rússia"},3,{"$f":"VLOOKUP($J8,Plan2!$B$2:$K$6,COLUMNS(Plan1!$K$5:K7)+1,FALSE)","v":"Rússia"},{"$f":"VLOOKUP($J8,Plan2!$B$2:$K$6,COLUMNS(Plan1!$K$5:L7)+1,FALSE)","v":0},{"$f":"VLOOKUP($J8,Plan2!$B$2:$K$6,COLUMNS(Plan1!$K$5:M7)+1,FALSE)","v":0},{"$f":"VLOOKUP($J8,Plan2!$B$2:$K$6,COLUMNS(Plan1!$K$5:N7)+1,FALSE)","v":0},{"$f":"VLOOKUP($J8,Plan2!$B$2:$K$6,COLUMNS(Plan1!$K$5:O7)+1,FALSE)","v":0},{"$f":"VLOOKUP($J8,Plan2!$B$2:$K$6,COLUMNS(Plan1!$K$5:P7)+1,FALSE)","v":0},{"$f":"VLOOKUP($J8,Plan2!$B$2:$K$6,COLUMNS(Plan1!$K$5:Q7)+1,FALSE)","v":0},{"$f":"VLOOKUP($J8,Plan2!$B$2:$K$6,COLUMNS(Plan1!$K$5:R7)+1,FALSE)","v":0},{"$f":"VLOOKUP($J8,Plan2!$B$2:$K$6,COLUMNS(Plan1!$K$5:S7)+1,FALSE)","v":0},null,null,null,null,null,{"$f":"IF(W6>W7,V6,IF(W7>W6,V7,\"A Definir\"))","v":"A Definir"}]
["2018-06-25",null,{"$f":"Plan2!C3","v":"Arábia Saudita"},null,null,"V",null,null,{"$f":"Plan2!C4","v":"Egito"},4,{"$f":"VLOOKUP($J9,Plan2!$B$2:$K$6,COLUMNS(Plan1!$K$5:K8)+1,FALSE)","v":"Uruguai"},{"$f":"VLOOKUP($J9,Plan2!$B$2:$K$6,COLUMNS(Plan1!$K$5:L8)+1,FALSE)","v":0},{"$f":"VLOOKUP($J9,Plan2!$B$2:$K$6,COLUMNS(Plan1!$K$5:M8)+1,FALSE)","v":0},{"$f":"VLOOKUP($J9,Plan2!$B$2:$K$6,COLUMNS(Plan1!$K$5:N8)+1,FALSE)","v":0},{"$f":"VLOOKUP($J9,Plan2!$B$2:$K$6,COLUMNS(Plan1!$K$5:O8)+1,FALSE)","v":0},{"$f":"VLOOKUP($J9,Plan2!$B$2:$K$6,COLUMNS(Plan1!$K$5:P8)+1,FALSE)","v":0},{"$f":"VLOOKUP($J9,Plan2!$B$2:$K$6,COLUMNS(Plan1!$K$5:Q8)+1,FALSE)","v":0},{"$f":"VLOOKUP($J9,Plan2!$B$2:$K$6,COLUMNS(Plan1!$K$5:R8)+1,FALSE)","v":0},{"$f":"VLOOKUP($J9,Plan2!$B$2:$K$6,COLUMNS(Plan1!$K$5:S8)+1,FALSE)","v":0},null,null,null,null,null,{"$f":"IF(W10>W11,V10,IF(W11>W10,V11,\"A Definir\"))","v":"A Definir"}]
[null,null,null,null,null,null,null,null,null,null,null,null,null,null,null,null,null,null,null,null,null,{"$f":"IF(AND(L22=3,L23=3,L24=3,L25=3),K22,\"A Definir\")","v":"A Definir"}]
["Grupo B",null,null,null,null,null,null,null,null,null,null,null,null,null,null,null,null,null,null,null,null,{"$f":"IF(AND(L30=3,L31=3,L32=3,L33=3),K31,\"A Definir\")","v":"A Definir"}]
["2018-06-15",null,"Portugal",null,null,"V",null,null,"Espanha",null,"Classificação Grupo B",null,null,null,null,null,null,null,null,null,null,null,null,null,null,null,null,{"$f":"IF(Z8>Z9,Y8,IF(Z9>Z8,Y9,\"A Definir\"))","v":"A Definir"}]
["2018-06-15",null,"Marrocos",null,null,"V",null,null,"Irã",null,"Seleções","JG","V","E","D","GP","GC","SG","PT",null,null,null,null,null,null,null,null,{"$f":"IF(Z16>Z17,Y16,IF(Z17>Z16,Y17,\"A Definir\"))","v":"A Definir"}]
["2018-06-20",null,"Portugal",null,null,"V",null,null,"Marrocos",1,{"$f":"VLOOKUP($J14,Plan2!$B$12:$K$16,COLUMNS(Plan1!$K$13:K13)+1,FALSE)","v":"Irã"},{"$f":"VLOOKUP($J14,Plan2!$B$12:$K$16,COLUMNS(Plan1!$K$13:L13)+1,FALSE)","v":0},{"$f":"VLOOKUP($J14,Plan2!$B$12:$K$16,COLUMNS(Plan1!$K$13:M13)+1,FALSE)","v":0},{"$f":"VLOOKUP($J14,Plan2!$B$12:$K$16,COLUMNS(Plan1!$K$13:N13)+1,FALSE)","v":0},{"$f":"VLOOKUP($J14,Plan2!$B$12:$K$16,COLUMNS(Plan1!$K$13:O13)+1,FALSE)","v":0},{"$f":"VLOOKUP($J14,Plan2!$B$12:$K$16,COLUMNS(Plan1!$K$13:P13)+1,FALSE)","v":0},{"$f":"VLOOKUP($J14,Plan2!$B$12:$K$16,COLUMNS(Plan1!$K$13:Q13)+1,FALSE)","v":0},{"$f":"VLOOKUP($J14,Plan2!$B$12:$K$16,COLUMNS(Plan1!$K$13:R13)+1,FALSE)","v":0},{"$f":"VLOOKUP($J14,Plan2!$B$12:$K$16,COLUMNS(Plan1!$K$13:S13)+1,FALSE)","v":0},null,null,{"$f":"IF(AND(L38=3,L39=3,L40=3,L41=3),K38,\"A Definir\")","v":"A Definir"}]
["2018-06-20",null,"Irã",null,null,"V",null,null,"Espanha",2,{"$f":"VLOOKUP($J15,Plan2!$B$12:$K$16,COLUMNS(Plan1!$K$13:K14)+1,FALSE)","v":"Espanha"},{"$f":"VLOOKUP($J15,Plan2!$B$12:$K$16,COLUMNS(Plan1!$K$13:L14)+1,FALSE)","v":0},{"$f":"VLOOKUP($J15,Plan2!$B$12:$K$16,COLUMNS(Plan1!$K$13:M14)+1,FALSE)","v":0},{"$f":"VLOOKUP($J15,Plan2!$B$12:$K$16,COLUMNS(Plan1!$K$13:N14)+1,FALSE)","v":0},{"$f":"VLOOKUP($J15,Plan2!$B$12:$K$16,COLUMNS(Plan1!$K$13:O14)+1,FALSE)","v":0},{"$f":"VLOOKUP($J15,Plan2!$B$12:$K$16,COLUMNS(Plan1!$K$13:P14)+1,FALSE)","v":0},{"$f":"VLOOKUP($J15,Plan2!$B$12:$K$16,COLUMNS(Plan1!$K$13:Q14)+1,FALSE)","v":0},{"$f":"VLOOKUP($J15,Plan2!$B$12:$K$16,COLUMNS(Plan1!$K$13:R14)+1,FALSE)","v":0},{"$f":"VLOOKUP($J15,Plan2!$B$12:$K$16,COLUMNS(Plan1!$K$13:S14)+1,FALSE)","v":0},null,null,{"$f":"IF(AND(L46=3,L47=3,L48=3,L49=3),K47,\"A Definir\")","v":"A Definir"}]
["2018-06-25",null,"Irã",null,null,"V",null,null,"Portugal",3,{"$f":"VLOOKUP($J16,Plan2!$B$12:$K$16,COLUMNS(Plan1!$K$13:K15)+1,FALSE)","v":"Marrocos"},{"$f":"VLOOKUP($J16,Plan2!$B$12:$K$16,COLUMNS(Plan1!$K$13:L15)+1,FALSE)","v":0},{"$f":"VLOOKUP($J16,Plan2!$B$12:$K$16,COLUMNS(Plan1!$K$13:M15)+1,FALSE)","v":0},{"$f":"VLOOKUP($J16,Plan2!$B$12:$K$16,COLUMNS(Plan1!$K$13:N15)+1,FALSE)","v":0},{"$f":"VLOOKUP($J16,Plan2!$B$12:$K$16,COLUMNS(Plan1!$K$13:O15)+1,FALSE)","v":0},{"$f":"VLOOKUP($J16,Plan2!$B$12:$K$16,COLUMNS(Plan1!$K$13:P15)+1,FALSE)","v":0},{"$f":"VLOOKUP($J16,Plan2!$B$12:$K$16,COLUMNS(Plan1!$K$13:Q15)+1,FALSE)","v":0},{"$f":"VLOOKUP($J16,Plan2!$B$12:$K$16,COLUMNS(Plan1!$K$13:R15)+1,FALSE)","v":0},{"$f":"VLOOKUP($J16,Plan2!$B$12:$K$16,COLUMNS(Plan1!$K$13:S15)+1,FALSE)","v":0},null,null,null,null,null,{"$f":"IF(W14>W15,V14,IF(W15>W14,V15,\"A Definir\"))","v":"A Definir"}]
["2018-06-25",null,"Espanha",null,null,"V",null,null,"Marrocos",4,{"$f":"VLOOKUP($J17,Plan2!$B$12:$K$16,COLUMNS(Plan1!$K$13:K16)+1,FALSE)","v":"Portugal"},{"$f":"VLOOKUP($J17,Plan2!$B$12:$K$16,COLUMNS(Plan1!$K$13:L16)+1,FALSE)","v":0},{"$f":"VLOOKUP($J17,Plan2!$B$12:$K$16,COLUMNS(Plan1!$K$13:M16)+1,FALSE)","v":0},{"$f":"VLOOKUP($J17,Plan2!$B$12:$K$16,COLUMNS(Plan1!$K$13:N16)+1,FALSE)","v":0},{"$f":"VLOOKUP($J17,Plan2!$B$12:$K$16,COLUMNS(Plan1!$K$13:O16)+1,FALSE)","v":0},{"$f":"VLOOKUP($J17,Plan2!$B$12:$K$16,COLUMNS(Plan1!$K$13:P16)+1,FALSE)","v":0},{"$f":"VLOOKUP($J17,Plan2!$B$12:$K$16,COLUMNS(Plan1!$K$13:Q16)+1,FALSE)","v":0},{"$f":"VLOOKUP($J17,Plan2!$B$12:$K$16,COLUMNS(Plan1!$K$13:R16)+1,FALSE)","v":0},{"$f":"VLOOKUP($J17,Plan2!$B$12:$K$16,COLUMNS(Plan1!$K$13:S16)+1,FALSE)","v":0},null,null,null,null,null,{"$f":"IF(W18>W19,V18,IF(W19>W18,V19,\"A Definir\"))","v":"A Definir"}]
[null,null,null,null,null,null,null,null,null,null,null,null,null,null,null,null,null,null,null,null,null,{"$f":"IF(AND(L54=3,L55=3,L56=3,L57=3),K54,\"A Definir\")","v":"A Definir"}]
["Grupo C",null,null,null,null,null,null,null,null,null,null,null,null,null,null,null,null,null,null,null,null,{"$f":"IF(AND(L62=3,L63=3,L64=3,L65=3),K63,\"A Definir\")","v":"A Definir"}]
["2018-06-16",null,"França",null,null,"V",null,null,"Austrália",null,"Classificação Grupo C"]
{"$rows_left_out":46}
{"sheet":"Plan2","index":1,"n_rows":80,"n_cols":18,"rows_kept":80,"cut":false,"hidden":false,"merged":[[0,2,0,10],[1,12,1,13],[10,2,10,10],[11,12,11,13],[21,2,21,10],[31,2,31,10],[42,2,42,10],[32,12,32,13],[43,12,43,13],[22,12,22,13],[73,12,73,13],[52,2,52,10],[53,12,53,13],[62,2,62,10],[63,12,63,13],[72,2,72,10]]}
[null,null,"Classificação Grupo A"]
[null,null,"Seleções","JG","V","E","D","GP","GC","SG","PT",null,"Pontos",null,null,"critério para rank"]
[null,{"$f":"RANK(P3,$P$3:$P$6,0)+COUNTIF($P$2:P2,P3)","v":1},"Arábia Saudita",{"$f":"COUNTIFS(Plan1!$C$4:$C$9,Plan2!C3,Plan1!$E$4:$E$9,\">=0\")+COUNTIFS(Plan1!$I$4:$I$9,Plan2!C3,Plan1!$G$4:$G$9,\">=0\")","v":0},{"$f":"COUNTIFS(Plan1!$C$4:$C$9,Plan2!C3,Plan2!$M$3:$M$8,3)+COUNTIFS(Plan1!$I$4:$I$9,Plan2!C3,Plan2!$N$3:$N$8,3)","v":0},{"$f":"COUNTIFS(Plan1!$C$4:$C$9,Plan2!C3,Plan2!$M$3:$M$8,1)+COUNTIFS(Plan1!$I$4:$I$9,Plan2!C3,Plan2!$N$3:$N$8,1)","v":0},{"$f":"COUNTIFS(Plan1!$C$4:$C$9,Plan2!C3,Plan2!$M$3:$M$8,0)+COUNTIFS(Plan1!$I$4:$I$9,Plan2!C3,Plan2!$N$3:$N$8,0)","v":0},{"$f":"SUMIF(Plan1!$C$4:$C$10,Plan2!C3,Plan1!$E$4:$E$9)+SUMIF(Plan1!$I$4:$I$9,Plan2!C3,Plan1!$G$4:$G$9)","v":0},{"$f":"SUMIF(Plan1!$C$4:$C$9,Plan2!C3,Plan1!$G$4:$G$9)+SUMIF(Plan1!$I$4:$I$9,Plan2!C3,Plan1!$E$4:$E$9)","v":0},{"$f":"+H3-I3","v":0},{"$f":"SUMIF(Plan1!$C$4:$C$9,Plan2!C3,Plan2!$M$3:$M$8)+SUMIF(Plan1!$I$4:$I$9,Plan2!C3,Plan2!$N$3:$N$8)","v":0},null,{"$f":"IF(Plan1!E4=\"\",\"\",IF(Plan1!E4>Plan1!G4,3,IF(Plan1!E4=Plan1!G4,1,0)))","v":""},{"$f":"IF(Plan1!G4=\"\",\"\",IF(Plan1!G4>Plan1!E4,3,IF(Plan1!G4=Plan1!E4,1,0)))","v":""},null,{"$f":"SUM(K3*1000000+J3*1000+H3*100)","v":0}]
[null,{"$f":"RANK(P4,$P$3:$P$6,0)+COUNTIF($P$2:P3,P4)","v":2},"Egito",{"$f":"COUNTIFS(Plan1!$C$4:$C$9,Plan2!C4,Plan1!$E$4:$E$9,\">=0\")+COUNTIFS(Plan1!$I$4:$I$9,Plan2!C4,Plan1!$G$4:$G$9,\">=0\")","v":0},{"$f":"COUNTIFS(Plan1!$C$4:$C$9,Plan2!C4,Plan2!$M$3:$M$8,3)+COUNTIFS(Plan1!$I$4:$I$9,Plan2!C4,Plan2!$N$3:$N$8,3)","v":0},{"$f":"COUNTIFS(Plan1!$C$4:$C$9,Plan2!C4,Plan2!$M$3:$M$8,1)+COUNTIFS(Plan1!$I$4:$I$9,Plan2!C4,Plan2!$N$3:$N$8,1)","v":0},{"$f":"COUNTIFS(Plan1!$C$4:$C$9,Plan2!C4,Plan2!$M$3:$M$8,0)+COUNTIFS(Plan1!$I$4:$I$9,Plan2!C4,Plan2!$N$3:$N$8,0)","v":0},{"$f":"SUMIF(Plan1!$C$4:$C$10,Plan2!C4,Plan1!$E$4:$E$9)+SUMIF(Plan1!$I$4:$I$9,Plan2!C4,Plan1!$G$4:$G$9)","v":0},{"$f":"SUMIF(Plan1!$C$4:$C$9,Plan2!C4,Plan1!$G$4:$G$9)+SUMIF(Plan1!$I$4:$I$9,Plan2!C4,Plan1!$E$4:$E$9)","v":0},{"$f":"+H4-I4","v":0},{"$f":"SUMIF(Plan1!$C$4:$C$9,Plan2!C4,Plan2!$M$3:$M$8)+SUMIF(Plan1!$I$4:$I$9,Plan2!C4,Plan2!$N$3:$N$8)","v":0},null,{"$f":"IF(Plan1!E5=\"\",\"\",IF(Plan1!E5>Plan1!G5,3,IF(Plan1!E5=Plan1!G5,1,0)))","v":""},{"$f":"IF(Plan1!G5=\"\",\"\",IF(Plan1!G5>Plan1!E5,3,IF(Plan1!G5=Plan1!E5,1,0)))","v":""},null,{"$f":"SUM(K4*1000000+J4*1000+H4*100)","v":0}]
[null,{"$f":"RANK(P5,$P$3:$P$6,0)+COUNTIF($P$2:P4,P5)","v":3},"Rússia",{"$f":"COUNTIFS(Plan1!$C$4:$C$9,Plan2!C5,Plan1!$E$4:$E$9,\">=0\")+COUNTIFS(Plan1!$I$4:$I$9,Plan2!C5,Plan1!$G$4:$G$9,\">=0\")","v":0},{"$f":"COUNTIFS(Plan1!$C$4:$C$9,Plan2!C5,Plan2!$M$3:$M$8,3)+COUNTIFS(Plan1!$I$4:$I$9,Plan2!C5,Plan2!$N$3:$N$8,3)","v":0},{"$f":"COUNTIFS(Plan1!$C$4:$C$9,Plan2!C5,Plan2!$M$3:$M$8,1)+COUNTIFS(Plan1!$I$4:$I$9,Plan2!C5,Plan2!$N$3:$N$8,1)","v":0},{"$f":"COUNTIFS(Plan1!$C$4:$C$9,Plan2!C5,Plan2!$M$3:$M$8,0)+COUNTIFS(Plan1!$I$4:$I$9,Plan2!C5,Plan2!$N$3:$N$8,0)","v":0},{"$f":"SUMIF(Plan1!$C$4:$C$10,Plan2!C5,Plan1!$E$4:$E$9)+SUMIF(Plan1!$I$4:$I$9,Plan2!C5,Plan1!$G$4:$G$9)","v":0},{"$f":"SUMIF(Plan1!$C$4:$C$9,Plan2!C5,Plan1!$G$4:$G$9)+SUMIF(Plan1!$I$4:$I$9,Plan2!C5,Plan1!$E$4:$E$9)","v":0},0,{"$f":"SUMIF(Plan1!$C$4:$C$9,Plan2!C5,Plan2!$M$3:$M$8)+SUMIF(Plan1!$I$4:$I$9,Plan2!C5,Plan2!$N$3:$N$8)","v":0},null,{"$f":"IF(Plan1!E6=\"\",\"\",IF(Plan1!E6>Plan1!G6,3,IF(Plan1!E6=Plan1!G6,1,0)))","v":""},{"$f":"IF(Plan1!G6=\"\",\"\",IF(Plan1!G6>Plan1!E6,3,IF(Plan1!G6=Plan1!E6,1,0)))","v":""},null,0]
[null,{"$f":"RANK(P6,$P$3:$P$6,0)+COUNTIF($P$2:P5,P6)","v":4},"Uruguai",{"$f":"COUNTIFS(Plan1!$C$4:$C$9,Plan2!C6,Plan1!$E$4:$E$9,\">=0\")+COUNTIFS(Plan1!$I$4:$I$9,Plan2!C6,Plan1!$G$4:$G$9,\">=0\")","v":0},{"$f":"COUNTIFS(Plan1!$C$4:$C$9,Plan2!C6,Plan2!$M$3:$M$8,3)+COUNTIFS(Plan1!$I$4:$I$9,Plan2!C6,Plan2!$N$3:$N$8,3)","v":0},{"$f":"COUNTIFS(Plan1!$C$4:$C$9,Plan2!C6,Plan2!$M$3:$M$8,1)+COUNTIFS(Plan1!$I$4:$I$9,Plan2!C6,Plan2!$N$3:$N$8,1)","v":0},{"$f":"COUNTIFS(Plan1!$C$4:$C$9,Plan2!C6,Plan2!$M$3:$M$8,0)+COUNTIFS(Plan1!$I$4:$I$9,Plan2!C6,Plan2!$N$3:$N$8,0)","v":0},{"$f":"SUMIF(Plan1!$C$4:$C$10,Plan2!C6,Plan1!$E$4:$E$9)+SUMIF(Plan1!$I$4:$I$9,Plan2!C6,Plan1!$G$4:$G$9)","v":0},{"$f":"SUMIF(Plan1!$C$4:$C$9,Plan2!C6,Plan1!$G$4:$G$9)+SUMIF(Plan1!$I$4:$I$9,Plan2!C6,Plan1!$E$4:$E$9)","v":0},0,{"$f":"SUMIF(Plan1!$C$4:$C$9,Plan2!C6,Plan2!$M$3:$M$8)+SUMIF(Plan1!$I$4:$I$9,Plan2!C6,Plan2!$N$3:$N$8)","v":0},null,{"$f":"IF(Plan1!E7=\"\",\"\",IF(Plan1!E7>Plan1!G7,3,IF(Plan1!E7=Plan1!G7,1,0)))","v":""},{"$f":"IF(Plan1!G7=\"\",\"\",IF(Plan1!G7>Plan1!E7,3,IF(Plan1!G7=Plan1!E7,1,0)))","v":""},null,0]
[null,null,null,null,null,null,null,null,null,null,null,null,{"$f":"IF(Plan1!E8=\"\",\"\",IF(Plan1!E8>Plan1!G8,3,IF(Plan1!E8=Plan1!G8,1,0)))","v":""},{"$f":"IF(Plan1!G8=\"\",\"\",IF(Plan1!G8>Plan1!E8,3,IF(Plan1!G8=Plan1!E8,1,0)))","v":""}]
[null,null,null,null,null,null,null,null,null,null,null,null,{"$f":"IF(Plan1!E9=\"\",\"\",IF(Plan1!E9>Plan1!G9,3,IF(Plan1!E9=Plan1!G9,1,0)))","v":""},{"$f":"IF(Plan1!G9=\"\",\"\",IF(Plan1!G9>Plan1!E9,3,IF(Plan1!G9=Plan1!E9,1,0)))","v":""}]
[]
[]
[null,null,"Classificação Grupo B"]
[null,null,"Seleções","JG","V","E","D","GP","GC","SG","PT",null,"Pontos",null,null,"critério para rank"]
[null,{"$f":"RANK(P13,$P$13:$P$16,0)+COUNTIF($P$12:P12,P13)","v":1},"Irã",{"$f":"COUNTIFS(Plan1!$C$12:$C$17,Plan2!C13,Plan1!$E$12:$E$17,\">=0\")+COUNTIFS(Plan1!$I$12:$I$17,Plan2!C13,Plan1!$G$12:$G$17,\">=0\")","v":0},{"$f":"COUNTIFS(Plan1!$C$12:$C$17,Plan2!C13,Plan2!$M$13:$M$18,3)+COUNTIFS(Plan1!$I$12:$I$17,Plan2!C13,Plan2!$N$13:$N$18,3)","v":0},{"$f":"COUNTIFS(Plan1!$C$12:$C$17,Plan2!C13,Plan2!$M$13:$M$18,1)+COUNTIFS(Plan1!$I$12:$I$17,Plan2!C13,Plan2!$N$13:$N$18,1)","v":0},{"$f":"COUNTIFS(Plan1!$C$12:$C$17,Plan2!C13,Plan2!$M$13:$M$18,0)+COUNTIFS(Plan1!$I$12:$I$17,Plan2!C13,Plan2!$N$13:$N$18,0)","v":0},{"$f":"SUMIF(Plan1!$C$12:$C$17,Plan2!C13,Plan1!$E$12:$E$17)+SUMIF(Plan1!$I$12:$I$17,Plan2!C13,Plan1!$G$12:$G$17)","v":0},{"$f":"SUMIF(Plan1!$C$12:$C$17,Plan2!C13,Plan1!$G$12:$G$17)+SUMIF(Plan1!$I$12:$I$17,Plan2!C13,Plan1!$E$12:$E$17)","v":0},{"$f":"+H13-I13","v":0},{"$f":"SUMIF(Plan1!$C$12:$C$17,Plan2!C13,Plan2!$M$13:$M$18)+SUMIF(Plan1!$I$12:$I$17,Plan2!C13,Plan2!$N$13:$N$18)","v":0},null,{"$f":"IF(Plan1!E12=\"\",\"\",IF(Plan1!E12>Plan1!G12,3,IF(Plan1!E12=Plan1!G12,1,0)))","v":""},{"$f":"IF(Plan1!G12=\"\",\"\",IF(Plan1!G12>Plan1!E12,3,IF(Plan1!G12=Plan1!E12,1,0)))","v":""},null,{"$f":"SUM(K13*1000000+J13*1000+H13*100)","v":0}]
[null,{"$f":"RANK(P14,$P$13:$P$16,0)+COUNTIF($P$12:P13,P14)","v":2},"Espanha",{"$f":"COUNTIFS(Plan1!$C$12:$C$17,Plan2!C14,Plan1!$E$12:$E$17,\">=0\")+COUNTIFS(Plan1!$I$12:$I$17,Plan2!C14,Plan1!$G$12:$G$17,\">=0\")","v":0},{"$f":"COUNTIFS(Plan1!$C$12:$C$17,Plan2!C14,Plan2!$M$13:$M$18,3)+COUNTIFS(Plan1!$I$12:$I$17,Plan2!C14,Plan2!$N$13:$N$18,3)","v":0},{"$f":"COUNTIFS(Plan1!$C$12:$C$17,Plan2!C14,Plan2!$M$13:$M$18,1)+COUNTIFS(Plan1!$I$12:$I$17,Plan2!C14,Plan2!$N$13:$N$18,1)","v":0},{"$f":"COUNTIFS(Plan1!$C$12:$C$17,Plan2!C14,Plan2!$M$13:$M$18,0)+COUNTIFS(Plan1!$I$12:$I$17,Plan2!C14,Plan2!$N$13:$N$18,0)","v":0},{"$f":"SUMIF(Plan1!$C$12:$C$17,Plan2!C14,Plan1!$E$12:$E$17)+SUMIF(Plan1!$I$12:$I$17,Plan2!C14,Plan1!$G$12:$G$17)","v":0},{"$f":"SUMIF(Plan1!$C$12:$C$17,Plan2!C14,Plan1!$G$12:$G$17)+SUMIF(Plan1!$I$12:$I$17,Plan2!C14,Plan1!$E$12:$E$17)","v":0},{"$f":"+H14-I14","v":0},{"$f":"SUMIF(Plan1!$C$12:$C$17,Plan2!C14,Plan2!$M$13:$M$18)+SUMIF(Plan1!$I$12:$I$17,Plan2!C14,Plan2!$N$13:$N$18)","v":0},null,{"$f":"IF(Plan1!E13=\"\",\"\",IF(Plan1!E13>Plan1!G13,3,IF(Plan1!E13=Plan1!G13,1,0)))","v":""},{"$f":"IF(Plan1!G13=\"\",\"\",IF(Plan1!G13>Plan1!E13,3,IF(Plan1!G13=Plan1!E13,1,0)))","v":""},null,{"$f":"SUM(K14*1000000+J14*1000+H14*100)","v":0}]
[null,{"$f":"RANK(P15,$P$13:$P$16,0)+COUNTIF($P$12:P14,P15)","v":3},"Marrocos",{"$f":"COUNTIFS(Plan1!$C$12:$C$17,Plan2!C15,Plan1!$E$12:$E$17,\">=0\")+COUNTIFS(Plan1!$I$12:$I$17,Plan2!C15,Plan1!$G$12:$G$17,\">=0\")","v":0},{"$f":"COUNTIFS(Plan1!$C$12:$C$17,Plan2!C15,Plan2!$M$13:$M$18,3)+COUNTIFS(Plan1!$I$12:$I$17,Plan2!C15,Plan2!$N$13:$N$18,3)","v":0},{"$f":"COUNTIFS(Plan1!$C$12:$C$17,Plan2!C15,Plan2!$M$13:$M$18,1)+COUNTIFS(Plan1!$I$12:$I$17,Plan2!C15,Plan2!$N$13:$N$18,1)","v":0},{"$f":"COUNTIFS(Plan1!$C$12:$C$17,Plan2!C15,Plan2!$M$13:$M$18,0)+COUNTIFS(Plan1!$I$12:$I$17,Plan2!C15,Plan2!$N$13:$N$18,0)","v":0},{"$f":"SUMIF(Plan1!$C$12:$C$17,Plan2!C15,Plan1!$E$12:$E$17)+SUMIF(Plan1!$I$12:$I$17,Plan2!C15,Plan1!$G$12:$G$17)","v":0},{"$f":"SUMIF(Plan1!$C$12:$C$17,Plan2!C15,Plan1!$G$12:$G$17)+SUMIF(Plan1!$I$12:$I$17,Plan2!C15,Plan1!$E$12:$E$17)","v":0},0,{"$f":"SUMIF(Plan1!$C$12:$C$17,Plan2!C15,Plan2!$M$13:$M$18)+SUMIF(Plan1!$I$12:$I$17,Plan2!C15,Plan2!$N$13:$N$18)","v":0},null,{"$f":"IF(Plan1!E14=\"\",\"\",IF(Plan1!E14>Plan1!G14,3,IF(Plan1!E14=Plan1!G14,1,0)))","v":""},{"$f":"IF(Plan1!G14=\"\",\"\",IF(Plan1!G14>Plan1!E14,3,IF(Plan1!G14=Plan1!E14,1,0)))","v":""},null,0]
[null,{"$f":"RANK(P16,$P$13:$P$16,0)+COUNTIF($P$12:P15,P16)","v":4},"Portugal",{"$f":"COUNTIFS(Plan1!$C$12:$C$17,Plan2!C16,Plan1!$E$12:$E$17,\">=0\")+COUNTIFS(Plan1!$I$12:$I$17,Plan2!C16,Plan1!$G$12:$G$17,\">=0\")","v":0},{"$f":"COUNTIFS(Plan1!$C$12:$C$17,Plan2!C16,Plan2!$M$13:$M$18,3)+COUNTIFS(Plan1!$I$12:$I$17,Plan2!C16,Plan2!$N$13:$N$18,3)","v":0},{"$f":"COUNTIFS(Plan1!$C$12:$C$17,Plan2!C16,Plan2!$M$13:$M$18,1)+COUNTIFS(Plan1!$I$12:$I$17,Plan2!C16,Plan2!$N$13:$N$18,1)","v":0},{"$f":"COUNTIFS(Plan1!$C$12:$C$17,Plan2!C16,Plan2!$M$13:$M$18,0)+COUNTIFS(Plan1!$I$12:$I$17,Plan2!C16,Plan2!$N$13:$N$18,0)","v":0},{"$f":"SUMIF(Plan1!$C$12:$C$17,Plan2!C16,Plan1!$E$12:$E$17)+SUMIF(Plan1!$I$12:$I$17,Plan2!C16,Plan1!$G$12:$G$17)","v":0},{"$f":"SUMIF(Plan1!$C$12:$C$17,Plan2!C16,Plan1!$G$12:$G$17)+SUMIF(Plan1!$I$12:$I$17,Plan2!C16,Plan1!$E$12:$E$17)","v":0},0,{"$f":"SUMIF(Plan1!$C$12:$C$17,Plan2!C16,Plan2!$M$13:$M$18)+SUMIF(Plan1!$I$12:$I$17,Plan2!C16,Plan2!$N$13:$N$18)","v":0},null,{"$f":"IF(Plan1!E15=\"\",\"\",IF(Plan1!E15>Plan1!G15,3,IF(Plan1!E15=Plan1!G15,1,0)))","v":""},{"$f":"IF(Plan1!G15=\"\",\"\",IF(Plan1!G15>Plan1!E15,3,IF(Plan1!G15=Plan1!E15,1,0)))","v":""},null,0]
[null,null,null,null,null,null,null,null,null,null,null,null,{"$f":"IF(Plan1!E16=\"\",\"\",IF(Plan1!E16>Plan1!G16,3,IF(Plan1!E16=Plan1!G16,1,0)))","v":""},{"$f":"IF(Plan1!G16=\"\",\"\",IF(Plan1!G16>Plan1!E16,3,IF(Plan1!G16=Plan1!E16,1,0)))","v":""}]
[null,null,null,null,null,null,null,null,null,null,null,null,{"$f":"IF(Plan1!E17=\"\",\"\",IF(Plan1!E17>Plan1!G17,3,IF(Plan1!E17=Plan1!G17,1,0)))","v":""},{"$f":"IF(Plan1!G17=\"\",\"\",IF(Plan1!G17>Plan1!E17,3,IF(Plan1!G17=Plan1!E17,1,0)))","v":""}]
[]
[]
{"$rows_left_out":60}