{"text_format":"1","workbook":"xlsx","n_sheets":6,"sheets":["Plan1","Início","INSTRUÇÕES","FUNCIONÁRIOS","ENTRADAS E SAÍDAS","Folha de Ponto"],"not_rendered":{"charts":0,"images":1,"macros":1,"external_links":0,"defined_names":3,"comments":0,"pivot_tables":0},"unopened":[],"bounds":{"document_bytes":16777216,"sheet_cells":100000,"rows_first":2000,"rows_last":500,"rows_between":2000,"halvings":0,"cell_chars":16384,"cell_head_chars":4096},"cells_cut":0,"cells_raw":0,"read":"whole","date_system":"1900"}

{"sheet":"Plan1","index":0,"n_rows":10,"n_cols":2,"rows_kept":10,"cut":false,"hidden":true,"merged":[]}
[10,0.16666666666666666]
[20,0.20833333333333301]
[30,0.25]
[40,0.29166666666666702]
[50,0.33333333333333298]
[60,0.375]
[70,0.41666666666666702]
[80,0.45833333333333298]
[90,0.5]
[100]

{"sheet":"Início","index":1,"n_rows":25,"n_cols":7,"rows_kept":25,"cut":false,"hidden":false,"merged":[[23,7,23,11],[24,7,24,11],[6,6,6,11]]}
[]
[]
[]
[]
[]
[]
[null,null,null,null,null,null,"PLANILHA DE FOLHA DE PONTO"]
[]
[]
[]
[]
[]
[]
[]
[]
[]
[]
[]
[]
[]
[]
[]
[]
[null,null,null,null,null,null,"Empregador"]
[null,null,null,null,null,null,"CNPJ:"]

{"sheet":"INSTRUÇÕES","index":2,"n_rows":35,"n_cols":11,"rows_kept":35,"cut":false,"hidden":false,"merged":[[34,1,34,12],[27,0,29,0],[27,1,29,12],[31,0,32,0],[31,1,32,12],[0,0,0,12],[14,1,14,12],[16,1,16,9],[23,0,25,0],[23,1,25,12],[8,1,8,12],[10,0,12,0],[10,1,12,12],[18,0,21,0],[18,1,21,12],[2,0,3,0],[2,1,2,12],[3,1,3,12],[5,0,6,0],[5,1,6,12]]}
["INSTRUÇÕES DE USO (LEIA ANTES DE UTILIZAR A PLANILHA)"]
[]
[1,"Antes de utilizar a planilha, é necessário habilitar as macros. Confira o passo a passo neste vídeo:"]
[null,"https://youtu.be/nOrhtwX-Oac"]
[]
[2,"Preencha os campos Empregador e CNPJ localizados no menu inicial. Essas informações estarão visíveis na folha de ponto dos funcionários."]
[]
[]
[3,"Cadastre os funcionários clicando no botão FUNCIONÁRIOS no menu inicial.\nPara obter orientações, clique no botão INSTRUÇÕES localizado no formulário."]
[]
[4,"Após cadastrar os funcionários, clique no botão LANÇAR HORAS no menu inicial para registrar as horas trabalhadas de cada funcionário.\nPara obter orientações, clique no botão INSTRUÇÕES localizado no formulário."]
[]
[]
[]
[5,"Para gerar a folha de ponto do funcionário, clique no botão FOLHA DE PONTO no menu inicial.\nPara obter orientações, clique no botão INSTRUÇÕES localizado no formulário."]
[]
[6,"Para maiores detalhes de uso da planilha, recomendamos que assista ao vídeo de demonstração de uso:",null,null,null,null,null,null,null,null,"https://youtu.be/t3ZB7IUAEos"]
[]
[7,"Não faça alterações diretamente na planilha. Qualquer alteração (inserir, editar ou deletar) deve ser feita através dos formulários no menu inicial. \nObservação: Caso haja linhas em branco entre os cadastros no banco de dados, a planilha poderá retonar erros. Portanto, você deverá utilizar sempre os formulários da planilha."]
[]
[]
[]
[]
[8,"A Planilha é 100% editável e você poderá realizar qualquer alteração que desejar. Apenas é necessário conhecimentos nos recursos utilizados na criação da planilha como, por exemplo, fórmulas e programação VBA.\nImportante: Não realizamos ajustes em nossas planilhas e, neste caso, qualquer alteração é de responsabilidade do usuário da planilha."]
[]
[]
[]
[9,"Este modelo de Planilha foi desenvolvido e testado no Microsoft Excel para Windows. Não garantimos a compatibilidade com o Excel para MAC, Google Sheets, Excel para celular ou tablet, ou qualquer outro software de Planilhas que não seja o Microsoft Excel para Windows.\t"]
[]
[]
[]
[10,"A Planilha de Ponto e Controle de Horas é comercializada exclusivamente no site oficial do desenvolvedor. A compra deste modelo não lhe garante o direito de comercializá-la ou distribuí-la em outros sites. Qualquer violação de direitos autorais, será respondida judicialmente."]
[]
[]
[11,"Caso tenha alguma dúvida, basta nos contatar através do e-mail contato@exceleasy.com.br ou através do WhatsApp: +55 (19) 99735-8062\t\t\t\t\t\t\t\t\t\t\t\t\t\t\t\t\t\t\t\t"]

{"sheet":"FUNCIONÁRIOS","index":3,"n_rows":2,"n_cols":8,"rows_kept":2,"cut":false,"hidden":false,"merged":[]}
[0]
["ID","Matrícula","Nome","Departamento","Função","Data de Admissão","Carga Horária Seg a Sex","Carga Horária Sáb e Dom"]

{"sheet":"ENTRADAS E SAÍDAS","index":4,"n_rows":1,"n_cols":10,"rows_kept":1,"cut":false,"hidden":false,"merged":[]}
["Matrícula","Nome","Data","Entrada","Intervalo","Retorno Intervalo","Saída","Horas trabalhadas","Horas Extras","Banco de Horas"]

{"sheet":"Folha de Ponto","index":5,"n_rows":20,"n_cols":11,"rows_kept":20,"cut":false,"hidden":false,"merged":[[10,4,10,5],[10,6,10,7],[2,1,2,11],[19,1,19,2],[19,10,19,11],[4,3,4,10],[8,3,8,5],[8,7,8,8],[12,8,12,9],[3,8,3,10],[7,3,7,10],[5,3,5,10],[9,3,9,5],[11,3,11,5],[6,3,6,8],[14,2,14,3],[14,7,14,8]]}
[]
[]
[null,"FOLHA DE PONTO"]
[]
[null,null,"Empregador / CNPJ:",{"$f":"Início!H24&\" - \"&Início!H25","v":" - "}]
[]
[null,null,"Funcionário:",null,null,null,null,null,null,"Matrícula:"]
[]
[null,null,"Departamento:",{"$f":"IFERROR(VLOOKUP(K7,FUNCIONÁRIOS!B:H,3,0),\"\")","v":""},null,null,"Função:",{"$f":"IFERROR(VLOOKUP(K7,FUNCIONÁRIOS!B:H,4,0),\"\")","v":""},null,"Admissão:",{"$f":"IFERROR(VLOOKUP(K7,FUNCIONÁRIOS!B:H,5,0),\"\")","v":""}]
[]
[null,null,"Jornada Diária:",{"$f":"IFERROR(VLOOKUP(K7,FUNCIONÁRIOS!B:H,6,0),\"\")","v":""},"Jonarda Fim de Semana:",null,{"$f":"IFERROR(VLOOKUP(K7,FUNCIONÁRIOS!B:H,7,0),\"\")","v":""},null,null,"Período:"]
[]
[]
[]
[null,null,"Assinatura do Funcionário:",null,null,null,null,"Assinatura do Empregador:"]
[]
[null,null,null,null,null,null,null,"Total Horas Trabalhadas","Total Horas Extras","Total Banco de Horas"]
[null,null,null,null,null,null,null,{"$f":"IFERROR(SUM(H21:H2000),\"\")","v":0},{"$f":"IFERROR(SUM(I21:I2000),\"\")","v":0},{"$f":"SUM(J21:J2000)","v":0}]
[]
[null,"Data",null,"Entrada","Intervalo","Retorno","Saída","Horas trabalhadas","Horas Extras","Banco de Horas","Observações"]