{"text_format":"1","workbook":"xlsx","n_sheets":6,"sheets":["Plan1","Início","INSTRUÇÕES","FUNCIONÁRIOS","ENTRADAS E SAÍDAS","Folha de Ponto"],"not_rendered":{"charts":0,"images":1,"macros":1,"external_links":0,"defined_names":3,"comments":0,"pivot_tables":0},"unopened":[],"bounds":{"document_bytes":16777216,"sheet_cells":100000,"rows_first":2000,"rows_last":500,"rows_between":2000,"halvings":0,"cell_chars":16384,"cell_head_chars":4096},"cells_cut":0,"cells_raw":0,"read":"whole","date_system":"1900"}

{"sheet":"Plan1","index":0,"n_rows":10,"n_cols":2,"rows_kept":10,"cut":false,"hidden":true,"merged":[]}
[10,0.16666666666666666]
[20,0.20833333333333301]
[30,0.25]
[40,0.29166666666666702]
[50,0.33333333333333298]
[60,0.375]
[70,0.41666666666666702]
[80,0.45833333333333298]
[90,0.5]
[100]

{"sheet":"Início","index":1,"n_rows":25,"n_cols":7,"rows_kept":25,"cut":false,"hidden":false,"merged":[[23,7,23,11],[24,7,24,11]]}
[]
[]
[]
[]
[]
[]
[]
[]
[]
[]
[]
[]
[]
[]
[]
[]
[]
[]
[]
[]
[]
[]
[]
[null,null,null,null,null,null,"Empregador"]
[null,null,null,null,null,null,"CNPJ:"]

{"sheet":"INSTRUÇÕES","index":2,"n_rows":26,"n_cols":4,"rows_kept":26,"cut":false,"hidden":false,"merged":[[0,0,0,10],[19,0,21,0],[14,0,17,0],[8,1,8,10],[20,1,20,10],[21,1,21,10],[19,1,19,10],[10,0,12,0],[10,1,12,10],[14,1,16,10],[6,1,7,10],[17,1,17,10],[2,1,2,10],[3,1,3,10],[2,0,4,0],[6,0,8,0]]}
["INSTRUÇÕES PARA USO PARA PLANILHA DE PONTO E CONTROLE DE HORAS"]
[]
[1,"Para o correto uso da planilha, confira o vídeo explicativo abaixo:"]
[null,"https://youtu.be/t3ZB7IUAEos"]
[]
[]
[2,"Ao abrir o arquivo pela primeira vez, certifique-se de que as macros da planilha estejam habilitadas. A planilha só irá funcionar se as macros estiverem habilitadas. Confira no link abaixo o passo a passo para habilitá-las:"]
[]
[null,"https://exceleasy.com.br/como-habilitar-macro-no-excel/"]
[]
[3,"Este modelo de Planilha foi desenvolvido e testado no Microsoft Excel para Windows. Por conter macros, é incompatível com o Excel para MAC, Google Sheets, Excel para celular ou tablet ou qualquer outro software de Planilhas que não seja o Microsoft Excel para Windows."]
[]
[]
[]
[4,"Todas as planilhas comercializadas em nossa loja são 100% editáveis e você poderá realizar qualquer alteração que desejar. Apenas é necessário conhecimentos nos recursos utilizados na criação da planilha como, por exemplo, fórmulas, gráficos e programação VBA quando for o caso.\n\nImportante: Não realizamos ajustes em planilhas e, neste caso, qualquer alteração é de responsabilidade do usuário da planilha."]
[]
[]
[null,"Importante: Não realizamos ajustes em planilhas e, neste caso, qualquer alteração é de responsabilidade do usuário da planilha."]
[]
[5,"Caso tenha alguma dúvida, recomendamos que confira nossa página de Perguntas Frequentes:"]
[null,"https://loja.exceleasy.com.br/perguntas-frequentes"]
[null,"Para dúvidas que não tenham sido respondidas em nossas sessão de Perguntas Frequentes, basta enviar um e-mail para contato@exceleasy.com.br"]
[]
[]
[]
[null,null,null,""]

{"sheet":"FUNCIONÁRIOS","index":3,"n_rows":2,"n_cols":7,"rows_kept":2,"cut":false,"hidden":false,"merged":[]}
[0]
["ID","Matrícula","Nome","Departamento","Função","Data de Admissão","Carga Horária Diária"]

{"sheet":"ENTRADAS E SAÍDAS","index":4,"n_rows":1,"n_cols":10,"rows_kept":1,"cut":false,"hidden":false,"merged":[]}
["Matrícula","Nome","Data","Entrada","Intervalo","Retorno Intervalo","Saída","Horas trabalhadas","Horas Extras","Banco de Horas"]

{"sheet":"Folha de Ponto","index":5,"n_rows":20,"n_cols":11,"rows_kept":20,"cut":false,"hidden":false,"merged":[[2,1,2,11],[19,1,19,2],[19,10,19,11],[4,3,4,10],[8,3,8,5],[8,7,8,8],[12,8,12,9],[3,8,3,10],[7,3,7,10],[5,3,5,10],[9,3,9,5],[11,3,11,5],[6,3,6,8],[14,2,14,3],[14,7,14,8]]}
[]
[]
[null,"FOLHA DE PONTO"]
[]
[null,null,"Empregador / CNPJ:",{"$f":"Início!H24&\" - \"&Início!H25","v":" - "}]
[]
[null,null,"Funcionário:",null,null,null,null,null,null,"Matrícula:"]
[]
[null,null,"Departamento:",{"$f":"IFERROR(VLOOKUP(K7,FUNCIONÁRIOS!B:G,3,0),\"\")","v":""},null,null,"Função:",{"$f":"IFERROR(VLOOKUP(K7,FUNCIONÁRIOS!B:G,4,0),\"\")","v":""},null,"Admissão:"]
[]
[null,null,"Jornada Diária:",{"$f":"IFERROR(VLOOKUP(K7,FUNCIONÁRIOS!B:G,6,0),\"\")","v":""},null,null,null,null,null,"Período:"]
[]
[]
[]
[null,null,"Assinatura do Funcionário:",null,null,null,null,"Assinatura do Empregador:"]
[]
[null,null,null,null,null,null,null,"Total Horas Trabalhadas","Total Horas Extras","Total Banco de Horas"]
[null,null,null,null,null,null,null,{"$f":"IFERROR(SUM(H21:H2000),\"\")","v":0},{"$f":"IFERROR(SUM(I21:I2000),\"\")","v":0},{"$f":"SUM(J21:J2000)","v":0}]
[]
[null,"Data",null,"Entrada","Intervalo","Retorno","Saída","Horas trabalhadas","Horas Extras","Banco de Horas","Observações"]