{"text_format":"1","workbook":"xlsx","n_sheets":6,"sheets":["Menu","Instruções","Lista de produtos","Clientes","Gerar Pedido","Sobre Nós"],"not_rendered":{"charts":0,"images":2,"macros":1,"external_links":2,"defined_names":28,"comments":0,"pivot_tables":0},"unopened":[],"bounds":{"document_bytes":16777216,"sheet_cells":100000,"rows_first":2000,"rows_last":500,"rows_between":2000,"halvings":0,"cell_chars":16384,"cell_head_chars":4096},"cells_cut":0,"cells_raw":0,"read":"whole","date_system":"1900"}

{"sheet":"Menu","index":0,"n_rows":4,"n_cols":5,"rows_kept":4,"cut":false,"hidden":false,"merged":[[4,3,16,10],[3,4,3,9]]}
[]
[]
[]
[null,null,null,null,"Planilha para Orçamentos e Pedidos"]

{"sheet":"Instruções","index":1,"n_rows":40,"n_cols":2,"rows_kept":40,"cut":false,"hidden":false,"merged":[[2,0,3,0],[5,0,8,0],[5,1,8,17],[2,1,2,17],[0,0,0,17],[10,0,11,0],[13,0,20,0],[22,1,22,17],[24,0,26,0],[24,1,26,17],[10,1,11,17],[36,0,37,0],[36,1,37,17],[39,1,39,17],[13,1,20,17],[32,1,33,17],[32,0,34,0],[34,1,34,11],[28,0,30,0],[28,1,30,17]]}
["INSTRUÇÕES DE USO (LEIA ANTES DE UTILIZAR A PLANILHA)"]
[]
[1,"Antes de utilizar a planilha, é necessário habilitar as macros. Confira o passo a passo neste vídeo:\t"]
[null,"https://youtu.be/nOrhtwX-Oac"]
[]
[2,"O primeiro passo é cadastrar os produtos acessando o botão do menu inicial \"Cadastrar Produto\" ou acessando a guia \"Lista de produtos\".\nCadastre seus produtos adicionando CÓDIGO, NOME e VALOR UNITÁRIO. Cada Produto deve ter seu próprio código.\nIMPORTANTE: NÃO DEIXE LINHAS EM BRANCO ENTRE OS CADASTROS DE PRODUTOS."]
[]
[]
[]
[]
[3,"Em seguida, cadastre seus clientes utilizando o botão do menu inicial \"Cadastrar Cliente\"\tou acessando a guia \"Clientes\". As informações cadastradas serão carregadas no cabeçalho do Pedido no campo do cliente."]
[]
[]
[4,"Para gerar um pedido, clique no botão \"Gerar Pedido\" no menu inicial ou acesse a guia \"Gerar Pedido\".\n\n1. Escolha um cliente selecionando a lista suspensa pelo nome (O cliente deve ter sido cadastrado anteriormente).\n2. Clique no botão \"Adicionar Produtos\" e insira os itens desejados. Não insira os produtos diretamente no pedido. Eles devem ser inseridos pelo formulário ao clicar no botão \"Adicionar Produto\"\n3. Clique no botão \"Gerar pedido PDF\". Automaticamente será criado um número para o Pedido.\n4. Para limpar a área, basta clicar no botão \"Limpar\".\nIMPORTANTE: Não use a tecla delete para apagar, pois algumas células com fórmulas não podem ser apagadas. Use sempre o botão limpar para começar um novo pedido. "]
[]
[]
[]
[]
[]
[]
[]
[]
[5,"A planilha gera o PDF de apenas um pedido por vez."]
[]
[6,"A Planilha é 100% editável e você poderá realizar qualquer alteração que desejar. Apenas é necessário conhecimentos nos recursos utilizados na criação da planilha como, por exemplo, fórmulas e programação VBA.\nImportante: Não realizamos ajustes em nossas planilhas e, neste caso, qualquer alteração é de responsabilidade do usuário da planilha."]
[]
[]
[]
[7,"Este modelo de Planilha foi desenvolvido e testado no Microsoft Excel para Windows. Não garantimos a compatibilidade com o Excel para MAC, Google Sheets, Excel para celular ou tablet, ou qualquer outro software de Planilhas que não seja o Microsoft Excel para Windows.\t"]
[]
[]
[]
[8,"Se você usa o Microsoft Excel 2007, então precisará instalar o Suplemento para conseguir exportar os Pedidos em PDF, caso contrário, receberá um erro ao clicar no botão \"Gerar Pedido PDF\". Se este for o seu caso, siga as etapas do link abaixo para instalar o suplemento."]
[]
[null,"https://exceleasy.com.br/wp-content/uploads/2023/03/Compatibilidade-PDF-Office.docx"]
[]
[9,"A Planilha de Orçamentos e Pedidos é comercializada exclusivamente no site oficial do desenvolvedor. A compra deste modelo não lhe garante o direito de comercializá-la ou distribuí-la em outros sites. Qualquer violação de direitos autorais, será respondida judicialmente."]
[]
[]
[10,"Caso tenha alguma dúvida, basta nos contatar através do e-mail contato@exceleasy.com.br ou através do WhatsApp: +55 (19) 99735-8062\t\t\t\t\t\t\t\t\t\t\t\t\t\t\t\t\t\t\t\t"]

{"sheet":"Lista de produtos","index":2,"n_rows":5,"n_cols":5,"rows_kept":5,"cut":false,"hidden":false,"merged":[[4,4,11,9]]}
["Código","Produto","Valor Unitário"]
[]
[]
[]
[null,null,null,null,"INSTRUÇÕES\nCadastre aqui os produtos da sua empresa adicionando CÓDIGO, NOME E VALOR UNITÁRIO. \nCada Produto deve ter seu próprio código.\n\nIMPORTANTE: NÃO DEIXE LINHAS EM BRANCO ENTRE OS CADASTROS DE PRODUTOS"]

{"sheet":"Clientes","index":3,"n_rows":5,"n_cols":8,"rows_kept":5,"cut":false,"hidden":false,"merged":[[4,7,7,12]]}
[]
["Nome:","CNPJ/CPF:","Endereço:","Cidade/Estado:","Fone:","Celular:"]
[]
[]
[null,null,null,null,null,null,null,"INSTRUÇÕES\nCadastre aqui os dados dos seus clientes.\nEssas informações serão carregadas no cabeçalho do Pedido"]

{"sheet":"Gerar Pedido","index":4,"n_rows":51,"n_cols":9,"rows_kept":51,"cut":false,"hidden":false,"merged":[[28,8,31,13],[7,8,27,13],[7,2,7,5],[10,2,10,3],[28,5,28,6],[1,1,5,3],[44,5,44,6],[41,5,41,6],[42,5,42,6],[43,5,43,6],[13,5,13,6],[35,5,35,6],[36,5,36,6],[37,5,37,6],[38,5,38,6],[39,5,39,6],[40,5,40,6],[27,5,27,6],[30,5,30,6],[31,5,31,6],[32,5,32,6],[48,5,48,6],[34,5,34,6],[45,5,45,6],[46,5,46,6],[47,5,47,6],[44,1,47,3],[14,5,14,6],[15,5,15,6],[16,5,16,6],[17,5,17,6],[18,5,18,6],[19,5,19,6],[20,5,20,6],[21,5,21,6],[22,5,22,6],[23,5,23,6],[24,5,24,6],[25,5,25,6],[26,5,26,6],[33,5,33,6],[29,5,29,6]]}
[{"$f":"COUNTA(B15:B44)+1","v":1}]
[null,"Insira aqui o banner da sua empresa"]
[null,null,null,null,null,"PEDIDO No"]
[null,null,null,null,null,0]
[]
[]
[]
[null,"Nome:",null,null,null,null,null,null,"INSTRUÇÕES\n\nPasso 1: Escolha um cliente selecionando a lista suspensa pelo nome (O cliente deve ter sido cadastrado anteriormente).\n\nPasso 2: Clique no botão \"Adicionar Produtos\" e insira os itens desejados. Não insira os produtos diretamente no pedido. Eles devem ser inseridos pelo formulário ao clicar no botão \"Adicionar Produto\"\n\nPasso 3: Clique no botão \"Gerar pedido PDF\". Automaticamente será criado um número para o Pedido. \n\nPasso 4: Para limpar a área, basta clicar no botão \"Limpar\".\n\nIMPORTANTE: Não use a tecla delete para apagar, pois algumas células com fórmulas não podem ser apagadas. Use sempre o botão limpar para começar um novo pedido. "]
[null,"CNPJ/CPF:",{"$f":"IFERROR(VLOOKUP(C8,Clientes!A3:F500,2,FALSE),\"\")","v":""},null,"Data:",{"$f":"TODAY()","v":"2023-03-07"}]
[null,"Endereço:",{"$f":"IFERROR(VLOOKUP(C8,Clientes!A3:F500,3,FALSE),\"\")","v":""},null,"Cidade/Estado:",{"$f":"IFERROR(VLOOKUP(C8,Clientes!A3:F500,4,FALSE),\"\")","v":""}]
[null,"Fone:",{"$f":"IFERROR(VLOOKUP(C8,Clientes!A3:F500,5,FALSE),\"\")","v":""},null,"Celular:",{"$f":"IFERROR(VLOOKUP(C8,Clientes!A3:F500,6,FALSE),\"\")","v":""}]
[]
[]
[null,"Código","Produto","Quantidade","Valor Unitário","Valor R$"]
[]
[]
[]
[]
[]
[]
[]
[]
[]
[]
[]
[]
[]
[]
[null,null,null,null,null,null,null,null,"Observação: A planilha não salva o histórico de Pedidos anteriores."]
[]
[]
[]
[]
[]
[]
[]
[]
[]
[]
[]
[]
[]
[]
[]
[null,null,null,null,"Desconto"]
[null,null,null,null,"Total",{"$f":"SUM(F15:G45)","v":0}]
[null,null,null,null,"Total com desconto",{"$f":"F46-((F46*F45))","v":0}]
[null,null,null,null,"Válido até"]
[null,"Observações",null,null,"Forma de Pagamento"]
[]
[null,"Assinatura:"]

{"sheet":"Sobre Nós","index":5,"n_rows":15,"n_cols":12,"rows_kept":15,"cut":false,"hidden":false,"merged":[[2,5,12,14],[14,5,15,7],[14,8,15,10],[14,11,15,14]]}
[]
[]
[null,null,null,null,null,"O Excel Easy nasceu em 2014 com o objetivo de unificar todo o material relacionado ao software Excel. Somos um ponto de apoio para aqueles que desejam aprender e revisar quaisquer assuntos relacionados ao Microsoft Excel. Além disso, também contamos com uma loja de planilhas personalizadas para facilitar o dia a dia dos usuários com soluções prontas para uso."]
[]
[]
[]
[]
[]
[]
[]
[]
[]
[]
[]
[null,null,null,null,null,"ARTIGOS",null,null,"PLANILHAS",null,null,"CONTATO"]